LinuxForum.Fans
Тема

EmguCV

Автор: andrei_yadrishnicov 1 сообщений 1053 просмотров
26.08.2014 14:34 #390722

Добрый день. Возникла необходимость захватывать видео с Web-камеры в Linux. При чем реализовывать это нужно на C#. В Windows довольно просто установить EmguCV и заюзать ее. В Ubuntu 14.04 что-то не выходит, хотя на офф сайте материал по установке специально под эту версию. В общем лог cmake -DBUILD_TESTS:BOOL=FALSE -DBUILD_DOCS:BOOL=FALSE -DWITH_TBB:BOOL=TRUE -DWITH_CUDA:BOOL=FALSE -DWITH_OPENCL:BOOL=FALSE . говорит следующее:

text

Determining if the system is big endian passed with the following output:
Change Dir: /home/areyny/emgu/CMakeFiles/CMakeTmp

Run Build Command:/usr/bin/make "cmTryCompileExec4213475267/fast" /usr/bin/make -f CMakeFiles/cmTryCompileExec4213475267.dir/build.make CMakeFiles/cmTryCompileExec4213475267.dir/build make[1]: Вход в каталог `/home/areyny/emgu/CMakeFiles/CMakeTmp' /usr/bin/cmake -E cmake_progress_report /home/areyny/emgu/CMakeFiles/CMakeTmp/CMakeFiles 1 Building C object CMakeFiles/cmTryCompileExec4213475267.dir/TestEndianess.c.o /usr/bin/cc -fsigned-char -W -Wall -Werror=return-type -Werror=non-virtual-dtor -Werror=address -Werror=sequence-point -Wformat -Werror=format-security -Wmissing-declarations -Wmissing-prototypes -Wstrict-prototypes -Wundef -Winit-self -Wpointer-arith -Wshadow -Wno-narrowing -fdiagnostics-show-option -Wno-long-long -pthread -fomit-frame-pointer -msse -msse2 -msse3 -ffunction-sections -fvisibility=hidden -O3 -DNDEBUG -o CMakeFiles/cmTryCompileExec4213475267.dir/TestEndianess.c.o -c /home/areyny/emgu/CMakeFiles/CMakeTmp/TestEndianess.c Linking C executable cmTryCompileExec4213475267 /usr/bin/cmake -E cmake_link_script CMakeFiles/cmTryCompileExec4213475267.dir/link.txt --verbose=1 /usr/bin/cc -fsigned-char -W -Wall -Werror=return-type -Werror=non-virtual-dtor -Werror=address -Werror=sequence-point -Wformat -Werror=format-security -Wmissing-declarations -Wmissing-prototypes -Wstrict-prototypes -Wundef -Winit-self -Wpointer-arith -Wshadow -Wno-narrowing -fdiagnostics-show-option -Wno-long-long -pthread -fomit-frame-pointer -msse -msse2 -msse3 -ffunction-sections -fvisibility=hidden -O3 -DNDEBUG CMakeFiles/cmTryCompileExec4213475267.dir/TestEndianess.c.o -o cmTryCompileExec4213475267 -rdynamic make[1]: Выход из каталога `/home/areyny/emgu/CMakeFiles/CMakeTmp'

TestEndianess.c: /* A 16 bit integer is required. */ typedef unsigned short cmakeint16;

/* On a little endian machine, these 16bit ints will give "THIS IS LITTLE ENDIAN." On a big endian machine the characters will be exchanged pairwise. */ const cmakeint16 info_little[] = {0x4854, 0x5349, 0x4920, 0x2053, 0x494c, 0x5454, 0x454c, 0x4520, 0x444e, 0x4149, 0x2e4e, 0x0000};

/* on a big endian machine, these 16bit ints will give "THIS IS BIG ENDIAN." On a little endian machine the characters will be exchanged pairwise. */ const cmakeint16 info_big[] = {0x5448, 0x4953, 0x2049, 0x5320, 0x4249, 0x4720, 0x454e, 0x4449, 0x414e, 0x2e2e, 0x0000};

#ifdef __CLASSIC_C__ int main(argc, argv) int argc; char *argv[]; #else int main(int argc, char *argv[]) #endif { int require = 0; require += info_little[argc]; require += info_big[argc]; (void)argv; return require; }

Determining if the include file sys/videoio.h exists failed with the following output: Change Dir: /home/areyny/emgu/CMakeFiles/CMakeTmp

Run Build Command:/usr/bin/make "cmTryCompileExec3017009027/fast" /usr/bin/make -f CMakeFiles/cmTryCompileExec3017009027.dir/build.make CMakeFiles/cmTryCompileExec3017009027.dir/build make[1]: Вход в каталог `/home/areyny/emgu/CMakeFiles/CMakeTmp' /usr/bin/cmake -E cmake_progress_report /home/areyny/emgu/CMakeFiles/CMakeTmp/CMakeFiles 1 Building C object CMakeFiles/cmTryCompileExec3017009027.dir/CheckIncludeFile.c.o /usr/bin/cc -fsigned-char -W -Wall -Werror=return-type -Werror=non-virtual-dtor -Werror=address -Werror=sequence-point -Wformat -Werror=format-security -Wmissing-declarations -Wmissing-prototypes -Wstrict-prototypes -Wundef -Winit-self -Wpointer-arith -Wshadow -Wno-narrowing -fdiagnostics-show-option -Wno-long-long -pthread -fomit-frame-pointer -msse -msse2 -msse3 -ffunction-sections -fvisibility=hidden -O3 -DNDEBUG -o CMakeFiles/cmTryCompileExec3017009027.dir/CheckIncludeFile.c.o -c /home/areyny/emgu/CMakeFiles/CMakeTmp/CheckIncludeFile.c /home/areyny/emgu/CMakeFiles/CMakeTmp/CheckIncludeFile.c:1:25: fatal error: sys/videoio.h: Нет такого файла или каталога #include <sys/videoio.h> ^ compilation terminated. make[1]: Выход из каталога `/home/areyny/emgu/CMakeFiles/CMakeTmp' make[1]: *** [CMakeFiles/cmTryCompileExec3017009027.dir/CheckIncludeFile.c.o] Ошибка 1 make: *** [cmTryCompileExec3017009027/fast] Ошибка 2

Determining if the include file ffmpeg/avformat.h exists failed with the following output: Change Dir: /home/areyny/emgu/CMakeFiles/CMakeTmp

Run Build Command:/usr/bin/make "cmTryCompileExec1955999161/fast" /usr/bin/make -f CMakeFiles/cmTryCompileExec1955999161.dir/build.make CMakeFiles/cmTryCompileExec1955999161.dir/build make[1]: Вход в каталог `/home/areyny/emgu/CMakeFiles/CMakeTmp' /usr/bin/cmake -E cmake_progress_report /home/areyny/emgu/CMakeFiles/CMakeTmp/CMakeFiles 1 Building C object CMakeFiles/cmTryCompileExec1955999161.dir/CheckIncludeFile.c.o /usr/bin/cc -fsigned-char -W -Wall -Werror=return-type -Werror=non-virtual-dtor -Werror=address -Werror=sequence-point -Wformat -Werror=format-security -Wmissing-declarations -Wmissing-prototypes -Wstrict-prototypes -Wundef -Winit-self -Wpointer-arith -Wshadow -Wno-narrowing -fdiagnostics-show-option -Wno-long-long -pthread -fomit-frame-pointer -msse -msse2 -msse3 -ffunction-sections -fvisibility=hidden -O3 -DNDEBUG -o CMakeFiles/cmTryCompileExec1955999161.dir/CheckIncludeFile.c.o -c /home/areyny/emgu/CMakeFiles/CMakeTmp/CheckIncludeFile.c /home/areyny/emgu/CMakeFiles/CMakeTmp/CheckIncludeFile.c:1:29: fatal error: ffmpeg/avformat.h: Нет такого файла или каталога #include <ffmpeg/avformat.h> ^ compilation terminated. make[1]: Выход из каталога `/home/areyny/emgu/CMakeFiles/CMakeTmp' make[1]: *** [CMakeFiles/cmTryCompileExec1955999161.dir/CheckIncludeFile.c.o] Ошибка 1 make: *** [cmTryCompileExec1955999161/fast] Ошибка 2

Determining if the include file sys/videoio.h exists failed with the following output: Change Dir: /home/areyny/emgu/CMakeFiles/CMakeTmp

Run Build Command:/usr/bin/make "cmTryCompileExec3681626638/fast" /usr/bin/make -f CMakeFiles/cmTryCompileExec3681626638.dir/build.make CMakeFiles/cmTryCompileExec3681626638.dir/build make[1]: Вход в каталог `/home/areyny/emgu/CMakeFiles/CMakeTmp' /usr/bin/cmake -E cmake_progress_report /home/areyny/emgu/CMakeFiles/CMakeTmp/CMakeFiles 1 Building C object CMakeFiles/cmTryCompileExec3681626638.dir/CheckIncludeFile.c.o /usr/bin/cc -fsigned-char -W -Wall -Werror=return-type -Werror=non-virtual-dtor -Werror=address -Werror=sequence-point -Wformat -Werror=format-security -Wmissing-declarations -Wmissing-prototypes -Wstrict-prototypes -Wundef -Winit-self -Wpointer-arith -Wshadow -Wno-narrowing -fdiagnostics-show-option -Wno-long-long -pthread -fomit-frame-pointer -msse -msse2 -msse3 -ffunction-sections -fvisibility=hidden -O3 -DNDEBUG -o CMakeFiles/cmTryCompileExec3681626638.dir/CheckIncludeFile.c.o -c /home/areyny/emgu/CMakeFiles/CMakeTmp/CheckIncludeFile.c /home/areyny/emgu/CMakeFiles/CMakeTmp/CheckIncludeFile.c:1:25: fatal error: sys/videoio.h: Нет такого файла или каталога #include <sys/videoio.h> ^ compilation terminated. make[1]: Выход из каталога `/home/areyny/emgu/CMakeFiles/CMakeTmp' make[1]: *** [CMakeFiles/cmTryCompileExec3681626638.dir/CheckIncludeFile.c.o] Ошибка 1 make: *** [cmTryCompileExec3681626638/fast] Ошибка 2

Determining if the include file ffmpeg/avformat.h exists failed with the following output: Change Dir: /home/areyny/emgu/CMakeFiles/CMakeTmp

Run Build Command:/usr/bin/make "cmTryCompileExec3941483106/fast" /usr/bin/make -f CMakeFiles/cmTryCompileExec3941483106.dir/build.make CMakeFiles/cmTryCompileExec3941483106.dir/build make[1]: Вход в каталог `/home/areyny/emgu/CMakeFiles/CMakeTmp' /usr/bin/cmake -E cmake_progress_report /home/areyny/emgu/CMakeFiles/CMakeTmp/CMakeFiles 1 Building C object CMakeFiles/cmTryCompileExec3941483106.dir/CheckIncludeFile.c.o /usr/bin/cc -fsigned-char -W -Wall -Werror=return-type -Werror=non-virtual-dtor -Werror=address -Werror=sequence-point -Wformat -Werror=format-security -Wmissing-declarations -Wmissing-prototypes -Wstrict-prototypes -Wundef -Winit-self -Wpointer-arith -Wshadow -Wno-narrowing -fdiagnostics-show-option -Wno-long-long -pthread -fomit-frame-pointer -msse -msse2 -msse3 -ffunction-sections -fvisibility=hidden -O3 -DNDEBUG -o CMakeFiles/cmTryCompileExec3941483106.dir/CheckIncludeFile.c.o -c /home/areyny/emgu/CMakeFiles/CMakeTmp/CheckIncludeFile.c /home/areyny/emgu/CMakeFiles/CMakeTmp/CheckIncludeFile.c:1:29: fatal error: ffmpeg/avformat.h: Нет такого файла или каталога #include <ffmpeg/avformat.h> ^ compilation terminated. make[1]: Выход из каталога `/home/areyny/emgu/CMakeFiles/CMakeTmp' make[1]: *** [CMakeFiles/cmTryCompileExec3941483106.dir/CheckIncludeFile.c.o] Ошибка 1 make: *** [cmTryCompileExec3941483106/fast] Ошибка 2

Determining if the include file sys/videoio.h exists failed with the following output: Change Dir: /home/areyny/emgu/CMakeFiles/CMakeTmp

Run Build Command:/usr/bin/make "cmTryCompileExec3875754443/fast" /usr/bin/make -f CMakeFiles/cmTryCompileExec3875754443.dir/build.make CMakeFiles/cmTryCompileExec3875754443.dir/build make[1]: Вход в каталог `/home/areyny/emgu/CMakeFiles/CMakeTmp' /usr/bin/cmake -E cmake_progress_report /home/areyny/emgu/CMakeFiles/CMakeTmp/CMakeFiles 1 Building C object CMakeFiles/cmTryCompileExec3875754443.dir/CheckIncludeFile.c.o /usr/bin/cc -fsigned-char -W -Wall -Werror=return-type -Werror=non-virtual-dtor -Werror=address -Werror=sequence-point -Wformat -Werror=format-security -Wmissing-declarations -Wmissing-prototypes -Wstrict-prototypes -Wundef -Winit-self -Wpointer-arith -Wshadow -Wno-narrowing -fdiagnostics-show-option -Wno-long-long -pthread -fomit-frame-pointer -msse -msse2 -msse3 -ffunction-sections -fvisibility=hidden -O3 -DNDEBUG -o CMakeFiles/cmTryCompileExec3875754443.dir/CheckIncludeFile.c.o -c /home/areyny/emgu/CMakeFiles/CMakeTmp/CheckIncludeFile.c /home/areyny/emgu/CMakeFiles/CMakeTmp/CheckIncludeFile.c:1:25: fatal error: sys/videoio.h: Нет такого файла или каталога #include <sys/videoio.h> ^ compilation terminated. make[1]: Выход из каталога `/home/areyny/emgu/CMakeFiles/CMakeTmp' make[1]: *** [CMakeFiles/cmTryCompileExec3875754443.dir/CheckIncludeFile.c.o] Ошибка 1 make: *** [cmTryCompileExec3875754443/fast] Ошибка 2

Determining if the include file ffmpeg/avformat.h exists failed with the following output: Change Dir: /home/areyny/emgu/CMakeFiles/CMakeTmp

Run Build Command:/usr/bin/make "cmTryCompileExec3335319904/fast" /usr/bin/make -f CMakeFiles/cmTryCompileExec3335319904.dir/build.make CMakeFiles/cmTryCompileExec3335319904.dir/build make[1]: Вход в каталог `/home/areyny/emgu/CMakeFiles/CMakeTmp' /usr/bin/cmake -E cmake_progress_report /home/areyny/emgu/CMakeFiles/CMakeTmp/CMakeFiles 1 Building C object CMakeFiles/cmTryCompileExec3335319904.dir/CheckIncludeFile.c.o /usr/bin/cc -fsigned-char -W -Wall -Werror=return-type -Werror=non-virtual-dtor -Werror=address -Werror=sequence-point -Wformat -Werror=format-security -Wmissing-declarations -Wmissing-prototypes -Wstrict-prototypes -Wundef -Winit-self -Wpointer-arith -Wshadow -Wno-narrowing -fdiagnostics-show-option -Wno-long-long -pthread -fomit-frame-pointer -msse -msse2 -msse3 -ffunction-sections -fvisibility=hidden -O3 -DNDEBUG -o CMakeFiles/cmTryCompileExec3335319904.dir/CheckIncludeFile.c.o -c /home/areyny/emgu/CMakeFiles/CMakeTmp/CheckIncludeFile.c /home/areyny/emgu/CMakeFiles/CMakeTmp/CheckIncludeFile.c:1:29: fatal error: ffmpeg/avformat.h: Нет такого файла или каталога #include <ffmpeg/avformat.h> ^ compilation terminated. make[1]: Выход из каталога `/home/areyny/emgu/CMakeFiles/CMakeTmp' make[1]: *** [CMakeFiles/cmTryCompileExec3335319904.dir/CheckIncludeFile.c.o] Ошибка 1 make: *** [cmTryCompileExec3335319904/fast] Ошибка 2

Determining if the include file sys/videoio.h exists failed with the following output: Change Dir: /home/areyny/emgu/CMakeFiles/CMakeTmp

Run Build Command:/usr/bin/make "cmTryCompileExec4096785848/fast" /usr/bin/make -f CMakeFiles/cmTryCompileExec4096785848.dir/build.make CMakeFiles/cmTryCompileExec4096785848.dir/build make[1]: Вход в каталог `/home/areyny/emgu/CMakeFiles/CMakeTmp' /usr/bin/cmake -E cmake_progress_report /home/areyny/emgu/CMakeFiles/CMakeTmp/CMakeFiles 1 Building C object CMakeFiles/cmTryCompileExec4096785848.dir/CheckIncludeFile.c.o /usr/bin/cc -fsigned-char -W -Wall -Werror=return-type -Werror=non-virtual-dtor -Werror=address -Werror=sequence-point -Wformat -Werror=format-security -Wmissing-declarations -Wmissing-prototypes -Wstrict-prototypes -Wundef -Winit-self -Wpointer-arith -Wshadow -Wno-narrowing -fdiagnostics-show-option -Wno-long-long -pthread -fomit-frame-pointer -msse -msse2 -msse3 -ffunction-sections -fvisibility=hidden -O3 -DNDEBUG -o CMakeFiles/cmTryCompileExec4096785848.dir/CheckIncludeFile.c.o -c /home/areyny/emgu/CMakeFiles/CMakeTmp/CheckIncludeFile.c /home/areyny/emgu/CMakeFiles/CMakeTmp/CheckIncludeFile.c:1:25: fatal error: sys/videoio.h: Нет такого файла или каталога #include <sys/videoio.h> ^ compilation terminated. make[1]: Выход из каталога `/home/areyny/emgu/CMakeFiles/CMakeTmp' make[1]: *** [CMakeFiles/cmTryCompileExec4096785848.dir/CheckIncludeFile.c.o] Ошибка 1 make: *** [cmTryCompileExec4096785848/fast] Ошибка 2

Determining if the include file ffmpeg/avformat.h exists failed with the following output: Change Dir: /home/areyny/emgu/CMakeFiles/CMakeTmp

Run Build Command:/usr/bin/make "cmTryCompileExec2388733266/fast" /usr/bin/make -f CMakeFiles/cmTryCompileExec2388733266.dir/build.make CMakeFiles/cmTryCompileExec2388733266.dir/build make[1]: Вход в каталог `/home/areyny/emgu/CMakeFiles/CMakeTmp' /usr/bin/cmake -E cmake_progress_report /home/areyny/emgu/CMakeFiles/CMakeTmp/CMakeFiles 1 Building C object CMakeFiles/cmTryCompileExec2388733266.dir/CheckIncludeFile.c.o /usr/bin/cc -fsigned-char -W -Wall -Werror=return-type -Werror=non-virtual-dtor -Werror=address -Werror=sequence-point -Wformat -Werror=format-security -Wmissing-declarations -Wmissing-prototypes -Wstrict-prototypes -Wundef -Winit-self -Wpointer-arith -Wshadow -Wno-narrowing -fdiagnostics-show-option -Wno-long-long -pthread -fomit-frame-pointer -msse -msse2 -msse3 -ffunction-sections -fvisibility=hidden -O3 -DNDEBUG -o CMakeFiles/cmTryCompileExec2388733266.dir/CheckIncludeFile.c.o -c /home/areyny/emgu/CMakeFiles/CMakeTmp/CheckIncludeFile.c /home/areyny/emgu/CMakeFiles/CMakeTmp/CheckIncludeFile.c:1:29: fatal error: ffmpeg/avformat.h: Нет такого файла или каталога #include <ffmpeg/avformat.h> ^ compilation terminated. make[1]: Выход из каталога `/home/areyny/emgu/CMakeFiles/CMakeTmp' make[1]: *** [CMakeFiles/cmTryCompileExec2388733266.dir/CheckIncludeFile.c.o] Ошибка 1 make: *** [cmTryCompileExec2388733266/fast] Ошибка 2

Determining if the include file sys/videoio.h exists failed with the following output: Change Dir: /home/areyny/emgu/CMakeFiles/CMakeTmp

Run Build Command:/usr/bin/make "cmTryCompileExec181643187/fast" /usr/bin/make -f CMakeFiles/cmTryCompileExec181643187.dir/build.make CMakeFiles/cmTryCompileExec181643187.dir/build make[1]: Вход в каталог `/home/areyny/emgu/CMakeFiles/CMakeTmp' /usr/bin/cmake -E cmake_progress_report /home/areyny/emgu/CMakeFiles/CMakeTmp/CMakeFiles 1 Building C object CMakeFiles/cmTryCompileExec181643187.dir/CheckIncludeFile.c.o /usr/bin/cc -fsigned-char -W -Wall -Werror=return-type -Werror=non-virtual-dtor -Werror=address -Werror=sequence-point -Wformat -Werror=format-security -Wmissing-declarations -Wmissing-prototypes -Wstrict-prototypes -Wundef -Winit-self -Wpointer-arith -Wshadow -Wno-narrowing -fdiagnostics-show-option -Wno-long-long -pthread -fomit-frame-pointer -msse -msse2 -msse3 -ffunction-sections -fvisibility=hidden -O3 -DNDEBUG -o CMakeFiles/cmTryCompileExec181643187.dir/CheckIncludeFile.c.o -c /home/areyny/emgu/CMakeFiles/CMakeTmp/CheckIncludeFile.c /home/areyny/emgu/CMakeFiles/CMakeTmp/CheckIncludeFile.c:1:25: fatal error: sys/videoio.h: Нет такого файла или каталога #include <sys/videoio.h> ^ compilation terminated. make[1]: Выход из каталога `/home/areyny/emgu/CMakeFiles/CMakeTmp' make[1]: *** [CMakeFiles/cmTryCompileExec181643187.dir/CheckIncludeFile.c.o] Ошибка 1 make: *** [cmTryCompileExec181643187/fast] Ошибка 2

Determining if the include file ffmpeg/avformat.h exists failed with the following output: Change Dir: /home/areyny/emgu/CMakeFiles/CMakeTmp

Run Build Command:/usr/bin/make "cmTryCompileExec1925338402/fast" /usr/bin/make -f CMakeFiles/cmTryCompileExec1925338402.dir/build.make CMakeFiles/cmTryCompileExec1925338402.dir/build make[1]: Вход в каталог `/home/areyny/emgu/CMakeFiles/CMakeTmp' /usr/bin/cmake -E cmake_progress_report /home/areyny/emgu/CMakeFiles/CMakeTmp/CMakeFiles 1 Building C object CMakeFiles/cmTryCompileExec1925338402.dir/CheckIncludeFile.c.o /usr/bin/cc -fsigned-char -W -Wall -Werror=return-type -Werror=non-virtual-dtor -Werror=address -Werror=sequence-point -Wformat -Werror=format-security -Wmissing-declarations -Wmissing-prototypes -Wstrict-prototypes -Wundef -Winit-self -Wpointer-arith -Wshadow -Wno-narrowing -fdiagnostics-show-option -Wno-long-long -pthread -fomit-frame-pointer -msse -msse2 -msse3 -ffunction-sections -fvisibility=hidden -O3 -DNDEBUG -o CMakeFiles/cmTryCompileExec1925338402.dir/CheckIncludeFile.c.o -c /home/areyny/emgu/CMakeFiles/CMakeTmp/CheckIncludeFile.c /home/areyny/emgu/CMakeFiles/CMakeTmp/CheckIncludeFile.c:1:29: fatal error: ffmpeg/avformat.h: Нет такого файла или каталога #include <ffmpeg/avformat.h> ^ compilation terminated. make[1]: Выход из каталога `/home/areyny/emgu/CMakeFiles/CMakeTmp' make[1]: *** [CMakeFiles/cmTryCompileExec1925338402.dir/CheckIncludeFile.c.o] Ошибка 1 make: *** [cmTryCompileExec1925338402/fast] Ошибка 2

Determining if the include file sys/videoio.h exists failed with the following output: Change Dir: /home/areyny/emgu/CMakeFiles/CMakeTmp

Run Build Command:/usr/bin/make "cmTryCompileExec257962478/fast" /usr/bin/make -f CMakeFiles/cmTryCompileExec257962478.dir/build.make CMakeFiles/cmTryCompileExec257962478.dir/build make[1]: Вход в каталог `/home/areyny/emgu/CMakeFiles/CMakeTmp' /usr/bin/cmake -E cmake_progress_report /home/areyny/emgu/CMakeFiles/CMakeTmp/CMakeFiles 1 Building C object CMakeFiles/cmTryCompileExec257962478.dir/CheckIncludeFile.c.o /usr/bin/cc -fsigned-char -W -Wall -Werror=return-type -Werror=non-virtual-dtor -Werror=address -Werror=sequence-point -Wformat -Werror=format-security -Wmissing-declarations -Wmissing-prototypes -Wstrict-prototypes -Wundef -Winit-self -Wpointer-arith -Wshadow -Wno-narrowing -fdiagnostics-show-option -Wno-long-long -pthread -fomit-frame-pointer -msse -msse2 -msse3 -ffunction-sections -fvisibility=hidden -O3 -DNDEBUG -o CMakeFiles/cmTryCompileExec257962478.dir/CheckIncludeFile.c.o -c /home/areyny/emgu/CMakeFiles/CMakeTmp/CheckIncludeFile.c /home/areyny/emgu/CMakeFiles/CMakeTmp/CheckIncludeFile.c:1:25: fatal error: sys/videoio.h: Нет такого файла или каталога #include <sys/videoio.h> ^ compilation terminated. make[1]: Выход из каталога `/home/areyny/emgu/CMakeFiles/CMakeTmp' make[1]: *** [CMakeFiles/cmTryCompileExec257962478.dir/CheckIncludeFile.c.o] Ошибка 1 make: *** [cmTryCompileExec257962478/fast] Ошибка 2

Determining if the include file ffmpeg/avformat.h exists failed with the following output: Change Dir: /home/areyny/emgu/CMakeFiles/CMakeTmp

Run Build Command:/usr/bin/make "cmTryCompileExec2038541593/fast" /usr/bin/make -f CMakeFiles/cmTryCompileExec2038541593.dir/build.make CMakeFiles/cmTryCompileExec2038541593.dir/build make[1]: Вход в каталог `/home/areyny/emgu/CMakeFiles/CMakeTmp' /usr/bin/cmake -E cmake_progress_report /home/areyny/emgu/CMakeFiles/CMakeTmp/CMakeFiles 1 Building C object CMakeFiles/cmTryCompileExec2038541593.dir/CheckIncludeFile.c.o /usr/bin/cc -fsigned-char -W -Wall -Werror=return-type -Werror=non-virtual-dtor -Werror=address -Werror=sequence-point -Wformat -Werror=format-security -Wmissing-declarations -Wmissing-prototypes -Wstrict-prototypes -Wundef -Winit-self -Wpointer-arith -Wshadow -Wno-narrowing -fdiagnostics-show-option -Wno-long-long -pthread -fomit-frame-pointer -msse -msse2 -msse3 -ffunction-sections -fvisibility=hidden -O3 -DNDEBUG -o CMakeFiles/cmTryCompileExec2038541593.dir/CheckIncludeFile.c.o -c /home/areyny/emgu/CMakeFiles/CMakeTmp/CheckIncludeFile.c /home/areyny/emgu/CMakeFiles/CMakeTmp/CheckIncludeFile.c:1:29: fatal error: ffmpeg/avformat.h: Нет такого файла или каталога #include <ffmpeg/avformat.h> ^ compilation terminated. make[1]: Выход из каталога `/home/areyny/emgu/CMakeFiles/CMakeTmp' make[1]: *** [CMakeFiles/cmTryCompileExec2038541593.dir/CheckIncludeFile.c.o] Ошибка 1 make: *** [cmTryCompileExec2038541593/fast] Ошибка 2

Determining if the include file ffmpeg/avformat.h exists failed with the following output: Change Dir: /home/areyny/emgu/CMakeFiles/CMakeTmp

Run Build Command:/usr/bin/make "cmTryCompileExec4182942439/fast" /usr/bin/make -f CMakeFiles/cmTryCompileExec4182942439.dir/build.make CMakeFiles/cmTryCompileExec4182942439.dir/build make[1]: Вход в каталог `/home/areyny/emgu/CMakeFiles/CMakeTmp' /usr/bin/cmake -E cmake_progress_report /home/areyny/emgu/CMakeFiles/CMakeTmp/CMakeFiles 1 Building C object CMakeFiles/cmTryCompileExec4182942439.dir/CheckIncludeFile.c.o /usr/bin/cc -fsigned-char -W -Wall -Werror=return-type -Werror=non-virtual-dtor -Werror=address -Werror=sequence-point -Wformat -Werror=format-security -Wmissing-declarations -Wmissing-prototypes -Wstrict-prototypes -Wundef -Winit-self -Wpointer-arith -Wshadow -Wno-narrowing -fdiagnostics-show-option -Wno-long-long -pthread -fomit-frame-pointer -msse -msse2 -msse3 -ffunction-sections -fvisibility=hidden -O3 -DNDEBUG -o CMakeFiles/cmTryCompileExec4182942439.dir/CheckIncludeFile.c.o -c /home/areyny/emgu/CMakeFiles/CMakeTmp/CheckIncludeFile.c /home/areyny/emgu/CMakeFiles/CMakeTmp/CheckIncludeFile.c:1:29: fatal error: ffmpeg/avformat.h: Нет такого файла или каталога #include <ffmpeg/avformat.h> ^ compilation terminated. make[1]: Выход из каталога `/home/areyny/emgu/CMakeFiles/CMakeTmp' make[1]: *** [CMakeFiles/cmTryCompileExec4182942439.dir/CheckIncludeFile.c.o] Ошибка 1 make: *** [cmTryCompileExec4182942439/fast] Ошибка 2

Determining if the include file ffmpeg/avformat.h exists failed with the following output: Change Dir: /home/areyny/emgu/CMakeFiles/CMakeTmp

Run Build Command:/usr/bin/make "cmTryCompileExec2653865728/fast" /usr/bin/make -f CMakeFiles/cmTryCompileExec2653865728.dir/build.make CMakeFiles/cmTryCompileExec2653865728.dir/build make[1]: Вход в каталог `/home/areyny/emgu/CMakeFiles/CMakeTmp' /usr/bin/cmake -E cmake_progress_report /home/areyny/emgu/CMakeFiles/CMakeTmp/CMakeFiles 1 Building C object CMakeFiles/cmTryCompileExec2653865728.dir/CheckIncludeFile.c.o /usr/bin/cc -fsigned-char -W -Wall -Werror=return-type -Werror=non-virtual-dtor -Werror=address -Werror=sequence-point -Wformat -Werror=format-security -Wmissing-declarations -Wmissing-prototypes -Wstrict-prototypes -Wundef -Winit-self -Wpointer-arith -Wshadow -Wno-narrowing -fdiagnostics-show-option -Wno-long-long -pthread -fomit-frame-pointer -msse -msse2 -msse3 -ffunction-sections -fvisibility=hidden -O3 -DNDEBUG -o CMakeFiles/cmTryCompileExec2653865728.dir/CheckIncludeFile.c.o -c /home/areyny/emgu/CMakeFiles/CMakeTmp/CheckIncludeFile.c /home/areyny/emgu/CMakeFiles/CMakeTmp/CheckIncludeFile.c:1:29: fatal error: ffmpeg/avformat.h: Нет такого файла или каталога #include <ffmpeg/avformat.h> ^ compilation terminated. make[1]: Выход из каталога `/home/areyny/emgu/CMakeFiles/CMakeTmp' make[1]: *** [CMakeFiles/cmTryCompileExec2653865728.dir/CheckIncludeFile.c.o] Ошибка 1 make: *** [cmTryCompileExec2653865728/fast] Ошибка 2

Determining if the include file ffmpeg/avformat.h exists failed with the following output: Change Dir: /home/areyny/emgu/CMakeFiles/CMakeTmp

Run Build Command:/usr/bin/make "cmTryCompileExec3056975461/fast" /usr/bin/make -f CMakeFiles/cmTryCompileExec3056975461.dir/build.make CMakeFiles/cmTryCompileExec3056975461.dir/build make[1]: Вход в каталог `/home/areyny/emgu/CMakeFiles/CMakeTmp' /usr/bin/cmake -E cmake_progress_report /home/areyny/emgu/CMakeFiles/CMakeTmp/CMakeFiles 1 Building C object CMakeFiles/cmTryCompileExec3056975461.dir/CheckIncludeFile.c.o /usr/bin/cc -fsigned-char -W -Wall -Werror=return-type -Werror=non-virtual-dtor -Werror=address -Werror=sequence-point -Wformat -Werror=format-security -Wmissing-declarations -Wmissing-prototypes -Wstrict-prototypes -Wundef -Winit-self -Wpointer-arith -Wshadow -Wno-narrowing -fdiagnostics-show-option -Wno-long-long -pthread -fomit-frame-pointer -msse -msse2 -msse3 -ffunction-sections -fvisibility=hidden -O3 -DNDEBUG -o CMakeFiles/cmTryCompileExec3056975461.dir/CheckIncludeFile.c.o -c /home/areyny/emgu/CMakeFiles/CMakeTmp/CheckIncludeFile.c /home/areyny/emgu/CMakeFiles/CMakeTmp/CheckIncludeFile.c:1:29: fatal error: ffmpeg/avformat.h: Нет такого файла или каталога #include <ffmpeg/avformat.h> ^ compilation terminated. make[1]: Выход из каталога `/home/areyny/emgu/CMakeFiles/CMakeTmp' make[1]: *** [CMakeFiles/cmTryCompileExec3056975461.dir/CheckIncludeFile.c.o] Ошибка 1 make: *** [cmTryCompileExec3056975461/fast] Ошибка 2

Determining if the include file ffmpeg/avformat.h exists failed with the following output: Change Dir: /home/areyny/emgu/CMakeFiles/CMakeTmp

Run Build Command:/usr/bin/make "cmTryCompileExec1913978658/fast" /usr/bin/make -f CMakeFiles/cmTryCompileExec1913978658.dir/build.make CMakeFiles/cmTryCompileExec1913978658.dir/build make[1]: Вход в каталог `/home/areyny/emgu/CMakeFiles/CMakeTmp' /usr/bin/cmake -E cmake_progress_report /home/areyny/emgu/CMakeFiles/CMakeTmp/CMakeFiles 1 Building C object CMakeFiles/cmTryCompileExec1913978658.dir/CheckIncludeFile.c.o /usr/bin/cc -fsigned-char -W -Wall -Werror=return-type -Werror=non-virtual-dtor -Werror=address -Werror=sequence-point -Wformat -Werror=format-security -Wmissing-declarations -Wmissing-prototypes -Wstrict-prototypes -Wundef -Winit-self -Wpointer-arith -Wshadow -Wno-narrowing -fdiagnostics-show-option -Wno-long-long -pthread -fomit-frame-pointer -msse -msse2 -msse3 -ffunction-sections -fvisibility=hidden -O3 -DNDEBUG -o CMakeFiles/cmTryCompileExec1913978658.dir/CheckIncludeFile.c.o -c /home/areyny/emgu/CMakeFiles/CMakeTmp/CheckIncludeFile.c /home/areyny/emgu/CMakeFiles/CMakeTmp/CheckIncludeFile.c:1:29: fatal error: ffmpeg/avformat.h: Нет такого файла или каталога #include <ffmpeg/avformat.h> ^ compilation terminated. make[1]: Выход из каталога `/home/areyny/emgu/CMakeFiles/CMakeTmp' make[1]: *** [CMakeFiles/cmTryCompileExec1913978658.dir/CheckIncludeFile.c.o] Ошибка 1 make: *** [cmTryCompileExec1913978658/fast] Ошибка 2

Determining if the include file ffmpeg/avformat.h exists failed with the following output: Change Dir: /home/areyny/emgu/CMakeFiles/CMakeTmp

Run Build Command:/usr/bin/make "cmTryCompileExec1634357529/fast" /usr/bin/make -f CMakeFiles/cmTryCompileExec1634357529.dir/build.make CMakeFiles/cmTryCompileExec1634357529.dir/build make[1]: Вход в каталог `/home/areyny/emgu/CMakeFiles/CMakeTmp' /usr/bin/cmake -E cmake_progress_report /home/areyny/emgu/CMakeFiles/CMakeTmp/CMakeFiles 1 Building C object CMakeFiles/cmTryCompileExec1634357529.dir/CheckIncludeFile.c.o /usr/bin/cc -fsigned-char -W -Wall -Werror=return-type -Werror=non-virtual-dtor -Werror=address -Werror=sequence-point -Wformat -Werror=format-security -Wmissing-declarations -Wmissing-prototypes -Wstrict-prototypes -Wundef -Winit-self -Wpointer-arith -Wshadow -Wno-narrowing -fdiagnostics-show-option -Wno-long-long -pthread -fomit-frame-pointer -msse -msse2 -msse3 -ffunction-sections -fvisibility=hidden -O3 -DNDEBUG -o CMakeFiles/cmTryCompileExec1634357529.dir/CheckIncludeFile.c.o -c /home/areyny/emgu/CMakeFiles/CMakeTmp/CheckIncludeFile.c /home/areyny/emgu/CMakeFiles/CMakeTmp/CheckIncludeFile.c:1:29: fatal error: ffmpeg/avformat.h: Нет такого файла или каталога #include <ffmpeg/avformat.h> ^ compilation terminated. make[1]: Выход из каталога `/home/areyny/emgu/CMakeFiles/CMakeTmp' make[1]: *** [CMakeFiles/cmTryCompileExec1634357529.dir/CheckIncludeFile.c.o] Ошибка 1 make: *** [cmTryCompileExec1634357529/fast] Ошибка 2

Отсутствие #include<ffmpeg/...> попытался исправить обычным копированием нужных файлов в /usr/include/ffmpeg/ Это не помогло.
Поможете?

Войдите или зарегистрируйтесь, чтобы ответить.